Cmake stop on first error

cmake stop on first error Call Stack (most recent call first): CMakeLists. 8. I want to install software from source after git clone. comment:5 Changed 8 years ago by mloskot Patch submitted to #611 should fix the problem, needs testing. . For that purpose you can use either the command-line utility cmake (or cmake3), the text-mode UI utility ccmake (or ccmake3) or the graphical utility cmake-gui, or use them interchangeably. What is Power Automate? Power Automate is a service for automating workflow across the growing number of apps and SaaS services that business users rely on. NMAKE : fatal error U1077: '"C:\Program Files (x86)\Microsoft Visual Studio 14. Visual Studio Command Prompt (vcvarsall. 1 is already a bit dated to be honest). SHELLFLAGS = -ec should be used. 18 are: The “CUDA” language can now be compiled using Clang on non-Windows platforms. This topic describes how to use CMake 3. exeâ nicht möglich: No such file or directory-----build x265-git failed delete the source folder under '/build32' and start again first close the batch window, then the shell window When I build an android project which includes ndk code. Although you don't want to ignore them, compiler warnings aren't something severe enough to actually keep your program from compiling. A cache is a storage location where data which is accessed repeatedly is stored. g. By default, the first remote system in the list under Tools > Options > Cross Platform > Connection Manager will be used. This error means that Windows is unable to connect to our security certificate's revocation server. Configure CMake until all the elements are found. 2_3 to 2. First, would you give us some details? I just dealt with a similar problem. If the issue continues after 24 hours, follow these steps: Make sure that your device has the latest version of iOS or iPadOS. txt in project4 Replying to [email protected]…. cl. e. 10. S. If that's set properly and you're still having trouble, the easiest way to fix it is to change an Internet Explorer setting (Ninite uses the same settings). Then, choose in Copy settings from the release configuration, and use the CMake name for this kind of build RelWithDebInfo. A problem has been detect and Windows has been shut down to prevent damage to your computer. 4 for vXworks compiler from windriver. g. Start here! Starte hier! Comience aqui! Inizia qui! محل شروع! 新手上路! Welcome to Ask Fedora! Please view the “Start here!” category before you begin using the forum! Disputes about the quality of goods and services are not "billing errors," so the dispute procedure doesn’t apply. When you reach the "Get ESP-IDF" instructions under Next Steps, stop, and then return to the instructions on this page. 4, I'm well aware its stopped developing. I got the following error: Build command failed. variable "CXX" or the CMake cache entry CMAKE_CXX_COMPILER to the full path. txt). Configuration. Official Google Chrome Help Center where you can find tips and tutorials on using Google Chrome and other answers to frequently asked questions. 12 ) project ( kaa-application C ) Mono depends on GCC 4. Type I errors are equivalent to false positives. pdb file. /build/CMakeFiles/CMakeTmp" does not exist. Am I correct in that Freecad should all compile at once or do I have to compile parts of it first, like the modules, or something? Rather than handling zlib handling manually, use find_package from CMake to find zlib properly. 0 cmake_minimum_required (VERSION 3. This passes the -k (–keep-going) option to gmake that tells it to “keep going” or continue with the build as much as possible after an error. Pastebin is a website where you can store text online for a set period of time. Let’s go back to the example of a drug being used to treat a disease. 8. Heat Therapy. What puzzles me is the fact that CMake: reports that it can not find the SimGearComponent file (which is definitely there, in CMakeModules ) as well as the cmake_minimum_required command (it's in the very first line of CMakeLists. For example, export CMAKE_CXX_FLAGS=${CXXFLAGS}. hpp: No such file or directory error, I suggest you to use the updated script and make a clean build. It doesn't even assume a posix shell iirc. This: No rule to make target '/usr/lib/x86_64-linux-gnu/libGL. Description. /usr/local/cmake/opencv4 - cmake package /usr/local/include/opencv4 - headers /usr/local/share/opencv4 - other files (e. Pastebin. Is your SDL properly installed? And looking at the CMake output, I'm guessing you're cross-compiling? Yes? There are flags that need to be set to properly cross It looks like something isn't quoted correctly (note how C:\Program is the first part of C:\Program Files (x86)\. cmake. Option 1: Use Snappy. While American children were found by Miller (1984), as they grow older, to place increasing reliance upon disposition as an explanation of events observed, the Hindu children of India by contrast based their explanations more on situations. Tell CMake where to find the compiler by setting either the environment. The return value is available as global static boolean variable named <flag>_validator_registered . The Download page also provides source releases. Fundamental attribution bias may not be universal across cultures. Just running the make. js instead of the emsdk’s, it may be node instead of nodejs , and you can adjust the NODE_JS attribute of your . /bootstrap; make` on basically any 'nix. -- The C compiler identification is GNU -- The CXX compiler identification is unknown -- Check for working C compiler: /usr/bin/gcc -- Check for working C compiler: /usr/bin/gcc -- works -- Detecting C compiler ABI info -- Detecting C compiler ABI info - done CMake Error: your CXX compiler: "CMAKE_CXX_COMPILER-NOTFOUND" was not found. This option may be used to specify a file from which to load cache entries before the first pass through the project’s CMake listfiles. Delete the key and restart the installation. To some extent I understood these webkit libraries were available in Qt4 version. Pastebin is a website where you can store text online for a set period of time. Linux and FreeBSD) allow certain keywords in RPATH entries, such as ${ORIGIN} (More details are available in the ld. I am not getting a right solution, and not understanding. @Piusha - The problem is that your machine has QT , but it's a version prior to 4. . log". CMake will start out and based on your system variables will try to automatically locate as many packages as possible. The compiler and linker will not find the headers/libraries unless you set the appropriate options, which is not obvious for first-time user. com is the number one paste tool since 2002. For that module we are going to build a new 'Sumo' style robot with WLAN capabilities using the ESP32 chip. For building and running ROS programs from inside IDEs, the ROS enviroment has to be set up. Version 1. /bootstrap; make` on basically any 'nix. 5. org for me to then go back to CMake. CMake is a 3rd party tool with its own documentation. No, these are just for convenience. 0 FATAL_ERROR) Although CMake has had support for all versions of Visual Studio, starting with version 6, Visual Studio 2017 is the first version to support CMake. CMAKE_BUILD_TYPE:STRING Sets the build type for make based generators. 2. After a fierce and lengthy battle in which CMake for Windows won by refusing to find the BOOST folders no matter what I did, I decided to switch to Mac where I was successful in getting past compiling with Xcode, so I have everything compiled. “cmake(1)” gained support for profiling of CMake scripts through the Any new CMake developer is first introduced to the testing process used in CMake development. General. This is actually my first experience with unit testing and it has quickly convinced me I should use CTest and/or Google Test from now on with all my C++ projects. This message is a reminder that Fedora 30 is nearing its end of life. CMake iterates over the Windows "running object table" (a COM thing) to find Visual Studio instances to ping to call the reload macro. The page item name. The Cmake icon installed by the installer was apparently for a 32-bit machine, not the 64-bit machine I'm using it on. So it seems I must somhow aquire FindOGRE. While building a kde plugin with cmake I get this error: Code: # Go back to FTP, rename the folder back to “plugins”. , a function mapping arbitrary inputs to a sample of values of some random variable), or of an estimator (i. Extracted the source code to C:/xmr-stak-cpu Extracted the binaries to C:/xmr-stak-dep cd C:/xmr-stak-cpu "C:\Program Files (x86)\Microsoft Visual Studio\2017\Community\Common7\Tools\VsMSBuildCmd. For this, I am following the suggested instructions on stackoverflow, can be found here. trained cascades in XML format) Since /usr/local is owned by the root user, the installation should be performed with elevated privileges (sudo): Build modern C++ apps for Windows using the tools of your choice, including MSVC, Clang, CMake, or MS Build. Programming Model ¶. I had installed cmake 2. > > CMake Error at CMakeLists. to the compiler, or to the compiler name if it is in the PATH. Unless directed otherwise, make will stop when it encounters an error during the construction process. Can CMake stop at the first error? It's all in the question. Extract the downloaded OpenCV file in a location of your choice and open CMake ( cmake-gui ). Turn off the Workspace I/O (to do that, in the Simulink model go to Simulation=>Parameters=> Data Import/Export and uncheck the time and output boxes). 0 release of GTest does not build with Visual Studio 2017 — you need to add the definition GTEST_HAS_TR1_TUPLE=0 to tell GTest not using ::tr1 stuff; Here is my appveyor I looked in "my down loaded to folder location then" /trunk/cMake/ and found FreeCadMacros. t_page_item record type, which is passed in as the 1st parameter to all item plug-in's Render Function Callback. I cannot get it to configure properly in CMake, nor can I obviously build it. Use -Wno-dev to suppress it. It is actually. exe"' : return code '0x2' Stop. The “cmake(1)” gained support for profiling of CMake scripts through the parameters “–profiling-output” and “–profiling-format”. cmake:17 > (find_package_handle_standard_args) > CMakeLists. But, John Lamp’s tutorial filled in enough blanks missing from CMake. 7 to HP NonStop using the OSS environment. Karl Runge took Dscho’s first version of x11vnc, which was just a proof-of-concept that the library actually is usable, and turned it into a fully fledged application whose community version can nowadays be found on GitHub. Thanks! This is the problem. Click on the Configuration Manager button. Why is debugging not working? My breakpoints aren't being hit The first Python package and only OpenCV prerequisite we’ll install is NumPy: $ pip install numpy We can now prepare OpenCV 4 for compilation on our Raspberry Pi. Any new CMake developer is first introduced to the testing process used in CMake development. The python_example and cmake_example repositories are also a good place to start. Pastebin. log". It is challenging to uncover a consistent cause of errors and, even if found, to provide a consistent viable solution that minimizes the chances of a recurrent event. Go in it, and change the folder names of the individual plugins, one by one. If you need to build a static library instead of a shared one, you can add -DBUILD_STATIC_LIB=ON to CMake flags. Step 1: Calculate the error (subtract one value from the other) ignore any minus sign. The FTDI drivers should be downloaded and installed automatically by Windows when your Azure Sphere device is first plugged in to your PC. This allows us to validate the system setup before moving on to real hardware and an IDE. Navigate into the PX4-Autopilot directory and start jMAVSim using the following command: Just seconding that I hit the same thing, windows 10 VS2017. CMake Warning: No source or binary directory provided. end()); Then, iterate over each character of key_num and convert it to the equivalent int value for Medical errors are a serious public health problem and a leading cause of death in the United States. failure_email: email address where bv_maker outputs are sent in case of failure. I have been looking forward to compiling my program: CLion seemed to work fine for the past few months until I got the Windows Feature update 1709 after which the Windows Defender did something! Th The problem here is not CMake, the problem is the Find command in this line: 'cmake --version ^| find "cmake version"' In the cmd prompt, type: where Find. Select Apple Software Update, click "Change" and then click "Repair". cmake:8 (include) CMakeLists. txt:12 (project) -- Configuring incomplete, errors occurred! I saw your videos about hot to export VST in new RackAFX version and I install cmake and create a variable path. The table below shows a (not necessarily complete list) of the compiler versions in various distributions. As the code is developed and checked into the version control system, continuous integration testing machines automatically build and test the new CMake code using CTest. If you use a build system, you need a build system installed, full stop. com. A “CMAKE_CUDA_ARCHITECTURES” variable was added to specify CUDA output architectures. This error might mean that your PC couldn't connect to the Windows Update servers. A surgeon can cut deeply into the thigh to relieve pressure and gain access to stop the bleeding. The CMake command-line tool displays STATUS to TRACE messages on stdout with the message preceded by two hyphens and a space. txt file and populates it with customizable settings for the project. At the first use, the program will automatically compile another Translating a character array into a integer string in C++. begin(), key_char. Symbols are located in the *. If a project call to message uses "FATAL_ERROR" it stops immediately and returns an error. Select Linux-Debug in the configuration drop-down. The second call then results in an attempt to scroll the web view, since the context menu can obscure the assisted node. . While CMake has become the de-facto standard buildsystem for C++, it's siblings CTest and CPack are less well known. When CMake is first run in an empty build tree, it creates a CMakeCache. The cache is the fastest available storage option available to the developer or the OS. After the Apple Java update, the cmake upgrade from 2. Strikethrough means it doesn’t satisfy the version needed. Clang (C) See Clang C++ but use CFLAGS instead of CXXFLAGS. This seems to be happening in CMake though, so not sure how ms-iot/ROSOnWindows is involved. Hello, I am trying to bootstrap CMake-2. Using the key_char string, the values of the chars in it will serve as the initial value of the ints. Every manufacturer seems to have their own way of wording it. btw, the red text in wiki says official cmake support since 3. txt:64 (find_package) This > warning is for project developers. This is required due to ESP8266 specific requirements regarding linked executable files. Install the latest CMake. In addition to this "Callback" architecture, V19 also supports a "Blocking I/O" model which uses read and write calls which may be more familiar to non-audio programmers. find_package(libImagePipeline REQUIRED) Now, the library is available like a normal target defined in CMake and can be linked to any other existing target with target_link_libraries . Call Stack (most recent call first): CMakeLists. 3/6. It returns false if the registration fails because a) the first argument does not refer to a commandline flag, or b) a different validator has already been registered for this flag. Adjusting the paths as required to Python and the Wireshark source tree. com/garethl) contributed a patch so now you can select whether to show the error list or not after a cancelled build from the Build menu. As first step, download and install CMake and Apache Ant, if you don’t have any of these. 3. # First Build (Using the jMAVSim Simulator) First we'll build a simulated target using a console environment. This is experimental and still under development. Developer Community for Visual Studio Product family. txt file and populates it with customizable settings for the project. Join 425,000 subscribers and get a daily digest of news, geek trivia, and our feature articles. std::vector<int> key_num(key_char. However, if you have a problem with goods or services you paid for with a credit or charge card, you can take the same legal actions against the card issuer as you can take under state law against the seller. Sorry to interrupt Close this window. It is also possible to tell your compiler to treat all warnings as if they were errors (in which case, the compiler will halt compilation if it finds any warnings). For example, keyboard controller errors often mean that your keyboard isn't plugged in. 1. 16. I'm using a fresh install of slackware64 with vbatts 4. cmake -G lists all the CMake supported generators, but only Visual Studio is supported for Wireshark builds. You might just need to refresh it. Parameter Description; p_item_name. 12\include\SDL. 4 requires QT 4. If you're using Vista or Windows 7, go into your "Uninstall a program" control panel. Table of Contents. cmake:45 (find_package) cmake/Dependencies. Fedora will stop maintaining and issuing updates for Fedora 30 on 2020-05-26. So please update your CMake . The CMake GUI displays all messages in its log area. 0\VC\BIN make. 0. 8. The second and third arguments–plus any further arguments if they were there–are then recombined by slicing $ {@:2}. 2 use external compiler. In this case run cmake again with the option before attempting make install. Click Accounts on the Windows Settings pane. Take advantage of the powerful MSVC compiler and libraries toolset or bring your own build tools to do the job. “find_file()” commands gained a new “REQUIRED” option that will stop processing with an error message if nothing is found. 0 with Qt 5. It can be parsed and displayed using the command bv_show_build_log. This started some interesting conversation in the CMake community as well as internally in our team and it was dubbed the missing link between CMake and the IDE. The second step is then the Here are listed some of the CMake variables that are used often, along with a brief explanation and LLVM-specific notes. cmake Add the installation prefix of "Xyz" to CMAKE_PREFIX_PATH or set "Xyz_DIR" to a directory containing one of the above files. e. Invoking all commands from the correct command prompt window solved all my issues. The problem is that the configure step never stops. There are two exceptions: a target starting with a period is not a default unless it contains one or more slashes, ‘ / ’, as well; and, a target that defines a pattern rule has no Pastebin. 1. exe. First of all – thank you for sharing this solution. 1 kde packages on stable. Wait until 48 hours after the bruise appeared, then put a heating pad or warm compress on it several times a day. gcc or g++. The loaded entries take priority over the project's default values. It doesn't even assume a posix shell iirc. It is not possible to build directly with CMake — Appveyor expects a sln file, you can generate it via CMake, e. CMake is used to control the software compilation process using simple platform and compiler independent configuration files, and generate native makefiles and workspaces that can be used in the compiler environment of your choice. Step #5: CMake and compile OpenCV 4 for your Raspberry Pi. 3 notes: Supports VS2013. CMake is a tool to simplify the build process for development projects across different platforms. This option may be used to specify a file from which to load cache entries before the first pass through the project's cmake listfiles. 5. As for fatal error: opencl_kernels. Question: When trying to run GTAV on PC, I am getting one of the following errors:"Social Club failed to initialize. txt:1098 > (find_package): By not providing > "FindQt5Core. If you followed the "Get ESP-IDF" instructions under Next Steps, just now or on a previous occasion, you should clear the IDF_PATH environment variable from your system before you continue. txt file and populates it with customizable settings for the project. 1. If you're using Windows XP, go into your "Add or Remove programs" control panel. To use a different generator modify the -G parameter. Step 2: Divide the error by the exact value (we get a decimal number) Step 3: Convert that to a percentage (by multiplying by 100 and adding a "%" sign) Your customizable and curated collection of the best in trusted news plus coverage of sports, entertainment, money, weather, travel, health and lifestyle, combined with Outlook/Hotmail, Facebook However, if nothing displays on the screen, the computer might use sounds (that is, beep codes) to tell you what is wrong. At the moment they only have a cmake file for Arduino MegaPro 2560, and Arduino UNO. so' tells us that either that file doesn't exist, or CMake cannot figure out how to link Try the 'catkin_make_isolated' command instead. If you use a credit card, you may have experienced some type of billing error, such as an unauthorized charge, a charge listed on your monthly account statement with the wrong date or amount, charges for goods that weren’t delivered as agreed, or the card issuer’s failure to post payments or other credits. The blank. gitlab. First, we create a setting group called mem_conf and fill it with several parameters. The NISTIR 7966 guideline from the Computer Security Division of NIST is a direct call to action for organizations regardless of industry and is a mandate for the US Federal government. cmake_minimum_required ( VERSION 2. CMake Error: The source directory ". Critical Evaluation. Many of these errors indicate hardware problems that a service technician should fix. First, restart your PC. To target Linux, change the project settings to Linux-Debug or Linux-Release. Heat boosts blood flow, and that can help clear up a bruise. . bat in the root folder. Hi. exe in command prompt to build a projects. If it's the first time you're connecting to a Linux system, the Connect to Remote System dialog appears. The only difference between the two is that python_example uses Python’s setuptools to build the module, while cmake_example uses CMake (which may be preferable for existing C++ projects). The easiest way to clear the CMOS is to enter the BIOS setup utility and choose to Reset BIOS Settings to their factory default levels. Cmake 3. AddressSanitizer exits on the first detected error. {{configCtrl2. This is by design: This approach allows AddressSanitizer to produce faster and smaller generated code (both by ~5%). CMake modules of these libraries will be developed first, because their structure is simple and similar to each other. This is a short example for the basic framework usage. Hi, We use for our complex project the Cmake 2. h", but the CMake extension is trying to look for it here: The long list of errors you report is due to the fact that CMake doesn't know to look for Qt in /opt, and you have to tell it explicitly by setting CMAKE_PREFIX_PATH (see the OpenBR OS X build instructions for an example). txt containing: # stop if CMake version is below 3. txt:54 (MESSAGE): The development files for ALSA or PulseAudio are required - libasound-dev, libpulse-dev-- Configuring incomplete, errors occurred! If the test is false, a message is displayed thanks to the MESSAGE directive with a weight set to FATAL_ERROR to stop any future processing. But in this case you can not use - prefix more (for personal command of the receipt) because the make will write that error is ignored but still will fail all the block. If this is the first time you’ve seen this Stop error screen, restart your computer. The first line sets the minimum CMake version required to build a kaa-application project. . En Español. CMake automatically generates build systems, such as Makefiles and Visual Studio project files. and when I type ls it brings up the hello program i made in the first part of pset1 – Joseph Aaron Woodward Jul 29 '15 at 0:18 This is my first experience with Cmake. This is Close every tab except for the one that’s showing the error message. , a mathematical function mapping a sample of data to an estimate of a parameter of the population from which the data is sampled). If make install fails because of missing permissions, then you probably forgot to call cmake with the -DCMAKE_INSTALL_PREFIX option. At first you should set the minimum required CMake version. cmake I opened it in Kate, searched for "generate_from_xml" and , as you said, there is a section about "generate_from_xml". This depends on the projects use of "message" in the CMakeLists. W5 WARNING_TRANSCRIP T_NO_START_CODON A protein coding transcript does not have a proper START codon. If a bug is detected, the program will print an error message to stderr and exit with a non-zero exit code. Navigate to the key: HKEY_LOCAL_MACHINE\SOFTWARE\Microsoft\Windows\CurrentVersion\Installer\ and check if Inprogress key exists. It will rebuild target files if they are missing or older than the dependency files. Hi, I try to cross compile Cuda code for Jetson Xavier. The type of build pipeline generated depends on the type of generator used, as explained in the following sections. The loaded entries take priority over the project’s default values. Open "Developer Command Prompt" for your version of Visual Studio. I am in a different position with respect to this fix. I was on cmake 3. If you invoke the compiler manually, add the -g option. c: No such file or directory gcc. Error while executing process /home/gongzelong/Android/Sdk I have put in a fix in CVS CMake: $ cvs commit -m "BUG: fix cmake so that if you configure with a bad env for cl, then with a good path, it will configure correctly" If you use a build system, you need a build system installed, full stop. I haven't tried building on windows, so I'm just going on the output you posted. e. . First we create a file called CMakeLists. It is possible to build LightGBM in debug mode. Stop. When CMake finishes, be sure to inspect the output of CMake under the Python 3 section: Figure 8: CMake configures your OpenCV 4 compilation from source on your Raspberry Pi 4 running Buster. Cmake is designed to run truly anywhere, with many backing generators, not just make. If they use "SEND_ERROR" it continues processing and returns an error Run "cmake --help-policy CMP0074" for policy details. If you're using a VPN connection to connect to a work network, disconnect from the network and turn off the VPN software (if applicable) and try upgrading again. For full documentation, check the CMake docs or execute cmake --help-variable VARIABLE_NAME. . When I try to run CMake (cmake . You can also access the options from Tools->Options->Stop on First Build Error, and the options are remembered between runs. Our project uses Makefiles with the following type of rule for each multi-directory sub-make: If any file fails to compile in one of the leaf makes, the build stops in that directory - but the rest of the make continues. Build tools - CMake and Ninja to build a full Application for ESP32 ESP-IDF that essentially contains API (software libraries and source code) for ESP32 and scripts to operate the Toolchain or get through the onboarding process using the following official plugins for integrated development environments (IDE) described in separate documents You can find the answer to your question in two ways: Choose category of technical note below and browse through the topics. The steps provided here should help fix any errors that come up during the Windows Update process. 2. In case there are no distribution packages yet, you can get the sources here: The cmake command will take about 3-5 minutes to run as it prepares and configures OpenCV for the compile. com is the number one paste tool since 2002. For this step, we’re going to setup our compile with CMake followed by running make to actually compile OpenCV. If the first rule has multiple targets, only the first target is taken as the default. Once the binary is installed, run it on CMake as you would any other project. The easiest way to do this is to add an underscore at the end: “_”. 0 with Cmake 3. Specifically, the first call to elementDidRefocus causes the context menu to be presented. make sudo make Billing Errors and Resolution Basics. Download the OpenCV library from its website. 7. 1. ""Social Club failed to load due to an incomplete installation. 8. This message is a reminder that Fedora 30 is nearing its end of life. bat" set CMAKE_PREFIX_PATH=C:\xmr-stak-dep\hwloc;C:\xmr-stak-dep\libmicrohttpd;C:\xmr-stak-dep\openssl mkdir build cd build cmake -G "Visual Studio 15 2017 Win64" -T v141,host=x64 . This option may be used to specify a file from which to load cache entries before the first pass through the project’s cmake listfiles. This means it is possible to create, edit, build, run and debug C++ code in Visual Studio 2017 without the need to explicitly generate VC++ projects, as that is taken care behind the scenes by the In CMake 3. This should not happen and it usually means the reference genome may have an error in this transcript. 6. cmake-format accepts configuration files in yaml, json, or python format. CMake is an open-source, cross-platform family of tools designed to build, test and package software. exe: fatal error: no input files compilation terminated. c file is a placeholder for CMake’s add_executable(). By continuing to browse this site you are agreeing to our use of cookies. Get to know the NIST 7966. It is Method #1: Clear the Cache & Try Again. txt files. See full list on cmake. Use the cmake_policy command to set the policy and suppress this warning. 2 notes: Gareth Lennox (https://github. The environment provided by OSS is very similar to Linux and Unix. 2 in a few months. 7. Continued Some people have additional risk factors for internal bleeding due to trauma. How i fixed it: cd /usr/src/lib/libkvm/ make && make install cd /usr/ports/devel/libuv make clean reinstall and than i compiled devel/cmake without any errors. As you see in the picture: Has anyone encountered the same problem??? To fix this problem, run cmake from the. Use this to normalize the LLVM_ENABLE_ZLIB, HAVE_ZLIB, HAVE_ZLIB_H. Unfold the Active Solution Configuration list, and select <New>. As of writing the latest version of CMake is 3. 8+ or Clang 3. 2_4 failed saying that I needed to install Java from Apple, which was already installed. The Stop on first build error check box controls whether the build should stop immediately after the first build error or not. Fixing bugs becomes unavoidable. The second line sets project name and language. CMake will not be able to correctly generate this project. Dynamic linkers on ELF-based systems (e. Both libraries have their official packages available for most Unix-like operating systems. Brief instructions are provided at the bottom of the window when the program is running. cmake:71 (message): SDL2_ROOT_DIR is not set. Close the stream and terminate the library. if cmake complains about missing akonadi headers, CMake Error: Could not find Akonadi includes. Quit other apps or programs that are running, and pause any app or file downloads. All that is needed is to add your respective board in it's own cmake file. Hi Guys Sorry if this has been discussed before, but I can't find any info on it. emscripten file to point to it. In the first screenshot (sorry I didn't know it would send it as soon as I pasted it), SDL. The MSE either assesses the quality of a predictor (i. txt:20 (find_package) That should be your first clue. I have run into some errors after compilation using cmake. I guess fixing this bug is not hard. If we reject the null hypothesis in this situation, then our claim is that the drug does, in fact, have some effect on a disease. cmake" in > CMAKE_MODULE_PATH this project has > asked CMake to find a package > configuration file provided by > "Qt5Core", but CMake did not find > one. 8. Cmake is pretty easy to bootstrap on a new host with minimal assumptions. 8. To do that, follow these steps: Step 1 Click Start menu and select Settings. The process makes use of the CMake family of tools (CMake, CTest, CPack, and CDash). First you use CMake to generate a build environment in a new directory. All other message types are sent to stderr and are not prefixed with hyphens. 2_3 before the Apple Java update. > cmake -G "Visual Studio 16 2019" -A Win32 . 3+ (it needs to support C++11) and on CMake 2. If this screen appears again, follow these steps: Check to be sure you have adequate disk space. In order to build CMake from a source tree on Windows, you must first install the latest binary version of CMake because it is used for building the source tree. Fedora will stop maintaining and issuing updates for Fedora 30 on 2020-05-26. Invoking "cmake" failed Feel free to discard CMake tickets, perhaps you can clarify the policy on wiki or just remove the wiki and CMake stuff from SVN to avoid confusions. Uninstall unnecessary extensions from Chrome . Cmake is pretty easy to bootstrap on a new host with minimal assumptions. This value is available by using the name attribute of the apex_plugin. There are also toolchain files you can use to specify more details for cross compilation. If all else fails, you can always use the MSBuild. To prevent this . 5. The additional scrolling is unwanted behavior, since it does not occur when focusing the node for the first time. I get a bunch of errors when CMake does basic check for compiler. When cmake is first run in an empty build tree, it creates a CMakeCache. Once the new configuration has been created, I recommend to save, close the IDE, and open it again. This talk gives a lightspeed introduction into these three tools and then focuses on best practices on building, testing, and packaging. (most recent call first Could not find a package configuration file provided by "Xyz" with any of the following names: XyzConfig. org’s tutorial and proceed much easier. This means GEOS-Chem doesn't impose environment variable requirements on superprojects. Literally just `. 2. And I got errors and warnings . Cmake is designed to run truly anywhere, with many backing generators, not just make. Projects using LibVNCServer/ LibVNCClient LibVNCServer x11vnc. Pastebin is a website where you can store text online for a set period of time. When something is dead and stuck in the running object table (which happens occasionally, but thankfully not frequently) then CMake hangs in that iteration loop waiting forever for that dead thing to respond. The first thing to check is that your date and time are set correctly. The “cmake_language()” command was added for meta-operations on Hey, I've been trying to compile from github the core from 6. This article demonstrates a convenient way to add them with automated source download and have them build directly as part of your project using add_subdirectory(). CMake Warning at modules/FindSDL2. 8, bumping to latest, 3. txt:93 (include) This warning is for project developers. Cannot download the information you requested inside the Office software. You can modify the packages to use for the build in the WITH > WITH_X menu points (where X is the package abbreviation). "no matching function for call to 'writeSTL::write('const TopologyData&, The "cmake-gui" executable is the CMake GUI. We will reduce complexity of CMake modules to bare minimum, since you are unlikely to compile these libraries yourself. info. Not so awesome is when you don’t have a pre-built gtest/gmock available to use. . ONESHELL will run all receipt block in one shell which has effect: if first command fails, next ones will be executed without problems. Call Stack (most recent call first): cmake/ProtoBuf. c++,arrays,string. CMake will not be able to correctly generate this project. Version 1. 7. The “add_library()” and “add_executable()” commands learned to create Alias Targets referencing non-“GLOBAL” Imported Targets. If you want CMake to compile C or C++ code, CMake needs to figure out what compiler it’s working with so that it can create the correct command lines to build your code. Separable compilation is not yet supported on any platform. I recently consulted a company on this exact matter - luckily CMake 3. Possible values are Release, Debug, RelWithDebInfo and The default goal is the target of the first rule in the first makefile. Getting make to stop on first error in multi-directory build. The second line sets project name and language. Use the search in top right corner to find a specific technote. I recently bought two ESP32-boards from OLIMEX and had problems uploading. Example ¶. The new semester is approaching in a very fast way, and so is the new lecture and lab module 'Advanced Distributed Systems' at the Lucerne University. Extension for Visual Studio - Stops a solution build immediately after a project has failed to build. It is worth noting the difference between CONFIG and DEFINE types: the former is only a CMake domain option, the latter is only a C language macro. This option may be used to specify a file from which to load cache entries before the first pass through the project’s cmake listfiles. Use -Wno-dev to suppress it. Since the kdesupport as a whole is quite large it is recommended that you selectively download the packages you need instead of fetching the entire The version can be specified on the commandline on the first CMake run using: -DCMAKE_VS_WINDOWS_TARGET_PLATFORM_VERSION= I got further after setting that, but I hit more issues later (so I assume my environment is messed up somehow), but maybe it will help someone with this issue. x and OpenCV2. But to go unoffical on cmake support for this seems bad IMHO. If you're using CMake, make sure the CMAKE_CXX_FLAGS is set. &quot; compilation. c. 0. Some of the more significant changes in CMake 3. 04 I've tried cloning from the github repo and downloading the zip directly from the cmake homepage. These errors, when received while opening links via Microsoft Office programs, generate the message Unable to open [url]. Tell CMake where to find the compiler by setting either the environment variable "CXX" or the CMake cache entry CMAKE_CXX_COMPILER to the full path to the compiler, or to the compiler name if it is in the PATH. FIND_PROGRAM (GZIP_TOOL NAMES gzip PATHS /bin /usr/bin /usr/local/bin) IF (NOT GZIP_TOOL) MESSAGE (FATAL_ERROR "Unable to find 'gzip' program") ENDIF (NOT GZIP_TOOL) CMakeLists. cp: Aufruf von stat für âx265. The Best Tech Newsletter Anywhere. h is located in: "C:\Users\spaxt\SDL2-2. M. . An example configuration file is given in the online documentation. 0+. As the code is developed and checked into the version control system, continuous integration testing machines automatically build and test the new CMake code using CTest. Reduce Secure Shell risk. 16 was just released and there was no need to resort to 3rd party CMake scripts for precompiled headers and unity builds (thanks to Cristian Adam for the hard work - MR 1, MR 2!!!). Using the Snappy package manager is the easiest way to install it and can be done by running the following command: I just spent a few minutes fixing the old CMAKE templates so they'll work with Arduino 1. Stop. When cmake is first run in an empty build tree, it creates a CMakeCache. See full list on foonathan. Keep coming back to your site to see when the error gets triggered or vanishes. You received this message because you are subscribed to the Google Groups "swri-ros-pkg-dev" group. Users who want to perform benchmarking can make LightGBM output time costs for different internal routines by adding -DUSE_TIMETAG=ON to CMake flags. When you do this, your source will be copied to your Linux machine where CMake will be run to generate the CMake cache for your project. Solution 3: Create a new local user account. You can configure the build with the standard CMAKE_C_COMPILER, CMAKE_CXX_COMPILER, CMAKE_Fortran_COMPILER, and CMAKE_PREFIX_PATH variables, rather than environment variables, if you'd prefer. 5 which can be installed using one of the following two options:. Definition and basic properties. CMake is used to control the software compilation process using simple platform and compiler independent configuration files. The author provided the following steps to install it: git submodule init git submodule update mkdir build;cd build cmake . If the drivers are installed correctly, you will see four USB Serial Converters listed under Universal Serial Bus controllers in Device Manager , as described in Set up your dev kit . cmake -G “Visual Studio 15 2017 Win64” The last 1. in case of projects with cross build, cmake does a nice job rather than using switching between nmake and autconf for windows and otherwise. CMake generates native makefiles and workspaces that can be used in the compiler environment of your choice. Providing the structure of your custom commands will help cmake-format to break them up in a pleasant way, and will help cmake-lint detect improper usages of them. exe C:\Windows\System32\find. This option may be used to specify a file from which to load cache entries before the first pass through the project's CMake listfiles. / -DCMAKE_BUILD_TYPE=Release; This resulted in the error messages:-- Build configuration: Release CMake Error at CMakeLists. cmake xyz-config. Get help from our community supported forum One may alternatively download and build CMake from source. I have checked that I am in pset1 dropbox and the source code file is mario. Call Stack (most recent call first): CMakeLists. I am try to compile for the first time on Ubuntu and cmake. Stop the stream by returning 1 from your callback, or by calling a stop function. \wireshark. However, some errors are easily fixed. Do you know how to get/make these? I would have expected all the necissary files to have been made already during the OGRE compiling process or had been present in the wiki files as there was no mention of having to make them. It was very strange, since it worked the first time, but never again ??? After googling around for quite some time, I found your solution. x . See also "/home/yograj/catkin_ws/build/CMakeFiles/CMakeError. If your local version of CMake is lower than the minimum, it will stop processing the project and report an error. g. Reusing your shell's environment. Get started with CMake Call Stack > (most recent call first): > cmake/modules/FindPowerShell. ls --fake-option exit_on_error $? !! will pass the exit code of the previous command as the first argument to exit_on_error () and then !! will expand to ls --fake-option as the second and third arguments. This warning is for project developers. For each of the headers used in your source (via #include directives), the compiler searches the so-called include-paths for these headers. You should try to reinstall CMake and if that doesn't help, upgrade your compiler (GCC 4. so man pages on The first initiative, in the CMake community, was the CMake-server prototype developed initially by Stephen Kelly to improve the tooling story for CMake. Users are encouraged to use this instead of specifying options manually, as this approach is compiler-agnostic. I have no clue CMake Error: CMAKE_CXX_COMPILER not set, after EnableLanguage | -- Configuring incomplete, errors occurred! sudo apt-get install cmake; and then repeated the command: cmake . All the code (Kaa SDK, ESP8266 SDK, and the demo application) is compiled as static libraries and linked into an executable file. If you want to use a different compiler, you can set CC or CXX environment variables. During the compilation I encounter several problems and currently I am stuck at the " simple test program. Is it really just this single line or are you eliding the PROJECT command? That one is required for anything to work . The key feature of the migratable-objects programming model is over-decomposition: The programmer decomposes the program into a large number of work units and data units, and specifies the computation in terms of creation of and interactions between these units, without any direct reference to the processor on which any unit resides. This line will log the build status for the given directory: OK/FAILED, last step executed, directory, start and stop date and time, machine and system. net Hi, I am know configuring opencv 3. Environment variable Boost_ROOT is set to: C:\boost\boost_1_69_0 For compatibility, CMake is ignoring the variable. json file (ctrl + s). cmake, OGREConfig. txt completed without errors – CMake will generate a build pipeline using the targets defined by the script. Sounds like either CMake is broken or your MinGW version is. exe: error: D:\Conhecimento\Puc Minas\20202\AEDII\Exerc+ícios\teste\cmake-build-debug\CMakeFiles\CMakeTmp\testCCompiler. Select Unix Makefiles as the CMake generator, then save the CMakeSettings. Once CMake hits a fatal error, VisualGDB will automatically stop at that statement: You can use the Call Stack and Watch windows to examine the program state, however as the message was already triggered, it is too late to change anything or skip the error line. or something similiar), then you lack the akonadi package which can be found in the kdesupport module. My installation only consist in download binary distributions, unzip the folder on my programFile folder on my local disc C: and then change the variable path to the bin folder of cmake unziped folder. You might want to set The REQUIRED keyword marking that the library is essential for the build and that CMake will stop with an error if the package is not found. exe The find. The process makes use of the CMake family of tools (CMake, CTest, CPack, and CDash). bat). If the access denied issue is caused by a corrupt account, you can resolve it by creating a new local user profile / account. 0 will be required to build KDE from svn trunk, which will become KDE 4. The first argument for devenv is usually a solution file or project file. 16, fixed it for me. If you want a sequence of int, then use a vector<int>. The exact menu option in your particular motherboard's BIOS may differ but look for phrases like reset to default, factory default, clear BIOS, load setup defaults, etc. On ROS Answers there is a thread about Which IDE(s) do ROS developers use? that might have further hints not yet entered here. When I type make mario, it continues to say no rule to make target stop still. 1. 15 and earlier, RPATH entries set via CMAKE_INSTALL_RPATH or via INSTALL_RPATH have not been escaped before being inserted into the cmake_install. txt file and populates it with customizable settings for the project. io Using gtest/gmock with CMake is awesome. I am currently setting up opencv and qtcreator, so I can use them together. By default, this box is unchecked. If you get "CMake no CMAKE_CXX_COMPILER found" on Windows, then install Visual Studio and create a blank C++ project, which will prompt you to install the compilers and tools necessary to compile LÖVR. I'm having trouble installing cmake to ubuntu 14. ) in my build folder (inside the source folder), I get the foll Stack Exchange Network Stack Exchange network consists of 176 Q&A communities including Stack Overflow , the largest, most trusted online community for developers to learn, share their knowledge, and build their careers. How does it work? We’ll begin by asking you questions about the Windows version you're using and the issue you’re experiencing. To unsubscribe from this group and stop receiving emails from it, send an email to swri-ros @googlegroups. cmake script. metaDescription}} This site uses cookies. They are both complete project examples with cross-platform build systems. It will not necessarily do all the rules in the makefile as all dependencies may not need updated. Stop Payment is a feature available to any account holder who contacts their bank BEFORE the check or draft they authorized is presented for payment. 1, and I want to use it later in Visual Studio 2015. See full list on cliutils. Critical Evaluation. > > Could not find a Modules are coming in C++20 but it will take a while before they are widely adopted, optimized and supported by tooling - what can we do right now?. 8. Building LAMMPS with CMake is a two-step process. However in Qt5 it's been deleted and incorporated into Qt webengine. When cmake is first run in an empty build tree, it creates a CMakeCache. It's trying to compile the code with msvc, and it looks like it's trying to target a 64bit architecture. Project configuration settings may be specified interactively. If the configure step succeeds – meaning CMakeLists. txt:63 (catkin_workspace) -- Configuring incomplete, errors occurred! See also "/home/yograj/catkin_ws/build/CMakeFiles/CMakeOutput. First, let's distinguish between the types of errors: most compilers will give three types of compile-time alerts: compiler warnings, compiler errors, and linker errors. com is the number one paste tool since 2002. When CMake is first run in an empty build tree, it creates a CMakeCache. Literally just `. exe of System32 has to come first. Development applications Click Start > Run Type regedit and click OK. 2, but vxworks is Treat warnings as errors. exe Output: C:\cygwin64\bin\find. starting August 4th, i. > Use -Wno-dev to suppress it. txt file and populates it with customizable settings for the project. cmake and ogre-config. Follow the instructions below. Found a pdf document on Cmake's github site that covers using cmake, ctest and cpack. DanKoloff from Olimex gave me some tips too, but it was a capacitor at EN that Below are a couple of things that you can do to avoid the memory allocation errors in Simulink: 1. Building CMake for HP NonStop. C++ desktop apps run in a console or in a window. This page has an error. Garver, Spring 1998 # Install Python sudo apt-get install python3 # Install CMake (optional, only needed for tests and building Binaryen or LLVM) sudo apt-get install cmake Note If you want to use your system’s Node. Monday in 2 weeks, CMake >= 2. It might take up to 24 hours to activate iMessage and FaceTime. For the new project we want to update the cmake to 3. When cmake encounters an error, sometimes it does not stop instantly but continues to process all CMake files. If not specified, no email will be sent and bv_maker outputs will be sent to the standard output. This is a good way to enforce the recommendation that you should fix all warnings (if you lack self-discipline, which most of us do). org gcc. . The account holder tells the bank the check number, the amount of the check and payee and the bank in turn looks for this check, or range of checks and returns the item(s) unpaid marked Stop Payment. T_MULTIPLE_STOP_CO DONS A protein coding transcript has two or more STOP codons in the middle of the coding sequence (CDS). cmake stop on first error


Cmake stop on first error